BDBM50390321 CHEMBL2070601
SMILES Nc1nc(nc2n(CC3CCCOC3)nnc12)C1CC1
InChI Key InChIKey=YRRVQFVQWONDTC-UHFFFAOYSA-N
Data  1 IC50
  Tab Delimited (TSV)   2D SDfile   Computed 3D by Vconf -m prep SDfile
Find this compound or compounds like it in BindingDB:
Activity Spreadsheet -- Enzyme Inhibition Constant Data from BindingDB
Found 1 hit for monomerid = 50390321
LigandPNGBDBM50390321(CHEMBL2070601)
Affinity DataIC50:  150nM. Assay description: Inhibition of PDE8B expressed in Sf9 insect cells
In DepthDetails ArticlePubMed