BDBM50390351 CHEMBL2070900
SMILES CC(C)Cc1nc(N)c2nnn(CC3CCCCO3)c2n1
InChI Key InChIKey=GWILAIQOLBYZOK-UHFFFAOYSA-N
Data  1 IC50
  Tab Delimited (TSV)   2D SDfile   Computed 3D by Vconf -m prep SDfile
Find this compound or compounds like it in BindingDB:
Activity Spreadsheet -- Enzyme Inhibition Constant Data from BindingDB
Found 1 hit for monomerid = 50390351
LigandPNGBDBM50390351(CHEMBL2070900)
Affinity DataIC50:  186nM. Assay description: Inhibition of PDE8B expressed in Sf9 insect cells
In DepthDetails ArticlePubMed