BDBM50390375 CHEMBL2070916
SMILES Cc1ccn2cc(Cn3nnc4c(N)nc(nc34)C3CC3)nc2c1
InChI Key InChIKey=ZXAIMPMKQNLKIV-UHFFFAOYSA-N
Data  1 IC50
  Tab Delimited (TSV)   2D SDfile   Computed 3D by Vconf -m prep SDfile
Find this compound or compounds like it in BindingDB:
Activity Spreadsheet -- Enzyme Inhibition Constant Data from BindingDB
Found 1 hit for monomerid = 50390375
LigandPNGBDBM50390375(CHEMBL2070916)
Affinity DataIC50:  25.5nM. Assay description: Inhibition of PDE8B expressed in Sf9 insect cells
In DepthDetails ArticlePubMed