BDBM50392699 CHEMBL2151368
SMILES CC(=O)N1CC(Cc2ccccc2)C(=N1)c1ccccc1
InChI Key InChIKey=SEHXMGVQUDTTFH-UHFFFAOYSA-N
Data  2 KI
  Tab Delimited (TSV)   2D SDfile   Computed 3D by Vconf -m prep SDfile
Find this compound or compounds like it in BindingDB:
Activity Spreadsheet -- Enzyme Inhibition Constant Data from BindingDB
Found 2 hits for monomerid = 50392699
TargetCannabinoid receptor 2(Homo sapiens (Human))
Avenue De L'Universit£
Curated by ChEMBL
LigandPNGBDBM50392699(CHEMBL2151368)
Affinity DataKi: >3.00E+3nM. Assay description: Displacement of [3H]CP55940 from human CB2 receptor expressed in CHO cell membranes after 1 hr by scintillation counting
In DepthDetails ArticlePubMed
TargetCannabinoid receptor 1(Homo sapiens (Human))
Avenue De L'Universit£
Curated by ChEMBL
LigandPNGBDBM50392699(CHEMBL2151368)
Affinity DataKi: >3.00E+3nM. Assay description: Displacement of [3H]CP55940 from human CB1 receptor expressed in CHO cell membranes after 1 hr by scintillation counting
In DepthDetails ArticlePubMed