BDBM50395134 CHEMBL2163558
SMILES O[C@@H]1[C@@H](COP([O-])([O-])=O)O[C@H]([C@@H]1O)n1cnc2c(NC3CCCC3)ncnc12
InChI Key InChIKey=ZLXWBMMFOMQXRH-SDBHATRESA-L
Data  1 EC50
  Tab Delimited (TSV)   2D SDfile   Computed 3D by Vconf -m prep SDfile
Find this compound or compounds like it in BindingDB:
Activity Spreadsheet -- Enzyme Inhibition Constant Data from BindingDB
Found 1 hit for monomerid = 50395134
TargetAdenosine receptor A1(Homo sapiens (Human))
University Of North Carolina At Chapel Hill
Curated by ChEMBL
LigandPNGBDBM50395134(CHEMBL2163558)
Affinity DataEC50:  100nM. Assay description: Agonist activity at human A1AR expressed in HEK293T/17 cells assessed as inhibition of isoproterenol-induced cAMP accumulation incubated for 10 mins ...
In DepthDetails ArticlePubMed