BDBM50396052 CHEMBL2170195
SMILES O=C1N(CCNCCCNCCCNCCN2C(=O)c3cccc4cccc(C2=O)c34)C(=O)c2cccc3cccc1c23
InChI Key InChIKey=ILCAUUDUYRCCKB-UHFFFAOYSA-N
Data  4 IC50
  Tab Delimited (TSV)   2D SDfile   Computed 3D by Vconf -m prep SDfile
Find this compound or compounds like it in BindingDB:
Activity Spreadsheet -- Enzyme Inhibition Constant Data from BindingDB
Found 4 hits for monomerid = 50396052
TargetNAD-dependent protein deacetylase sirtuin-1(Homo sapiens (Human))
Sirtris A Gsk
Curated by ChEMBL
LigandPNGBDBM50396052(CHEMBL2170195)
Affinity DataIC50:  4.30E+4nM. Assay description: Inhibition of SIRT1
In DepthDetails ArticlePubMed
TargetNAD-dependent protein deacetylase sirtuin-1(Homo sapiens (Human))
Sirtris A Gsk
Curated by ChEMBL
LigandPNGBDBM50396052(CHEMBL2170195)
Affinity DataIC50:  4.00E+4nM. Assay description: Inhibition of sirtuin 1 (unknown origin)
In DepthDetails ArticlePubMed
TargetNAD-dependent protein deacetylase(Leishmania infantum)
Dipartimento Di Chimica E Tecnologie Del Farmaco "Sapienza" Universit£
Curated by ChEMBL
LigandPNGBDBM50396052(CHEMBL2170195)
Affinity DataIC50:  5.70E+3nM. Assay description: Inhibition of N-terminal His6-tagged recombinant Leishmania infantum SIR2RP1 expressed in Escherichia coli in presence of NAD+ by fluorimetric method
In DepthDetails ArticlePubMed
TargetNAD-dependent protein deacetylase sirtuin-1(Homo sapiens (Human))
Sirtris A Gsk
Curated by ChEMBL
LigandPNGBDBM50396052(CHEMBL2170195)
Affinity DataIC50:  4.30E+4nM. Assay description: Inhibition of human SIRT1 assessed as NAD+-dependent deacetylase activity using acetylated tubuline as substrate measured after overnight incubation ...
In DepthDetails ArticlePubMed