BDBM50396931 CHEMBL2170793
SMILES O[C@@H]1[C@@H]2C[C@@H]2[C@H]([C@@H]1O)n1cnc2c(N[C@H](C3CC3)c3ccccc3)nc(Cl)nc12
InChI Key InChIKey=NSOKXABWNKYUGW-YRKZSDTESA-N
Data  2 KI
  Tab Delimited (TSV)   2D SDfile   Computed 3D by Vconf -m prep SDfile
Find this compound or compounds like it in BindingDB:
Activity Spreadsheet -- Enzyme Inhibition Constant Data from BindingDB
Found 2 hits for monomerid = 50396931
TargetAdenosine receptor A3(Homo sapiens (Human))
National Institute Of Diabetes And Digestive And Kidney Diseases
Curated by ChEMBL
LigandPNGBDBM50396931(CHEMBL2170793)
Affinity DataKi:  790nM. Assay description: Displacement of [125I]I-AB-MECA from human A3 adenosine receptor expressed in CHO cells after 60 min Packard Cobra 2 gamma-counter
In DepthDetails ArticlePubMed
TargetAdenosine receptor A1(Homo sapiens (Human))
National Institute Of Diabetes And Digestive And Kidney Diseases
Curated by ChEMBL
LigandPNGBDBM50396931(CHEMBL2170793)
Affinity DataKi:  3.00E+3nM. Assay description: Displacement of [3H]R-PIA from human A1 adenosine receptor expressed in CHO cells after 60 min by Perkin Elmer Liquid Scintillation Analyzer
In DepthDetails ArticlePubMed