BDBM50398916 CHEMBL2178780
SMILES COc1ccc2CN(CCCCC(=O)NC34CC5CC(C)(CC(C)(C5)C3)C4)CC[C@@]34C=C[C@H](O)C[C@@H]3Oc1c24
InChI Key InChIKey=JQVPXABUZCLODH-QDBWGMRUSA-N
Data  1 KI  1 IC50
  Tab Delimited (TSV)   2D SDfile   Computed 3D by Vconf -m prep SDfile
Find this compound or compounds like it in BindingDB:
Activity Spreadsheet -- Enzyme Inhibition Constant Data from BindingDB
Found 2 hits for monomerid = 50398916
TargetGlutamate receptor ionotropic, NMDA 2B(Rattus norvegicus (Rat))
Istituto Italiano Di Tecnologia
Curated by ChEMBL
LigandPNGBDBM50398916(CHEMBL2178780)
Affinity DataKi: >1.00E+5nM. Assay description: Displacement of [3H]Ifenprodil from NMDAR-2B in Sprague-Dawley rat frontal cortex homogenates after 2 hrs by liquid scintillation counting
In DepthDetails ArticlePubMed
TargetAcetylcholinesterase(Rattus norvegicus (rat))
Istituto Italiano Di Tecnologia
Curated by ChEMBL
LigandPNGBDBM50398916(CHEMBL2178780)
Affinity DataIC50:  369nM. Assay description: Inhibition of AChE in Wistar rat brain homogenates using acetylthiocholine iodide and DTNB as substrate after 10 mins by Ellman method
In DepthDetails ArticlePubMed