BDBM50399074 CHEMBL2178863
SMILES Oc1cccc(NC2=NC(=O)C(S2)=Cc2cccc(O)c2)c1
InChI Key InChIKey=DZMICVVRVNEAFB-UHFFFAOYSA-N
Data  1 KI
  Tab Delimited (TSV)   2D SDfile   Computed 3D by Vconf -m prep SDfile
Find this compound or compounds like it in BindingDB:
Activity Spreadsheet -- Enzyme Inhibition Constant Data from BindingDB
Found 1 hit for monomerid = 50399074
TargetMacrophage migration inhibitory factor(Plasmodium falciparum)
Yale University
Curated by ChEMBL
LigandPNGBDBM50399074(CHEMBL2178863)
Affinity DataKi:  2.06E+4nM. Assay description: Inhibition of recombinant Plasmodium falciparum MIF expressed in Escherichia coli BL21 (DE3) assessed as ketonization of enol form of 4-HPP substrate...
In DepthDetails ArticlePubMed