BDBM50399694 CHEMBL2178934
SMILES NC(=O)c1cncc(n1)-c1ccc(cc1)[C@H]1CC[C@H](CCO)CC1
InChI Key InChIKey=OZMNASCPQFCIEP-HDJSIYSDSA-N
Data  1 IC50
  Tab Delimited (TSV)   2D SDfile   Computed 3D by Vconf -m prep SDfile
Find this compound or compounds like it in BindingDB:
Activity Spreadsheet -- Enzyme Inhibition Constant Data from BindingDB
Found 1 hit for monomerid = 50399694
TargetDiacylglycerol O-acyltransferase 1(Homo sapiens (Human))
Astrazeneca
Curated by ChEMBL
LigandPNGBDBM50399694(CHEMBL2178934)
Affinity DataIC50:  1.20E+3nM. Assay description: Inhibition of human recombinant DGAT1 expressed in Sf9 cells by liquid scintillography
In DepthDetails ArticlePubMed