BDBM50400822 CHEMBL2205028
SMILES Brc1ccc(cc1)S1=NS(=O)(=O)c2cc(NS(=O)(=O)c3ccccc3)ccc12
InChI Key InChIKey=ZXSXVMOHFUGVOY-UHFFFAOYSA-N
Data  2 IC50
  Tab Delimited (TSV)   2D SDfile   Computed 3D by Vconf -m prep SDfile
Find this compound or compounds like it in BindingDB:
Activity Spreadsheet -- Enzyme Inhibition Constant Data from BindingDB
Found 2 hits for monomerid = 50400822
TargetEpidermal growth factor receptor(Homo sapiens (Human))
Bristol-Myers Squibb Pharmaceutical Research And Development
Curated by ChEMBL
LigandPNGBDBM50400822(CHEMBL2205028)
Affinity DataIC50: >4.00E+4nM. Assay description: Inhibition of HER1
In DepthDetails ArticlePubMed
TargetReceptor tyrosine-protein kinase erbB-2(Homo sapiens (Human))
Bristol-Myers Squibb Pharmaceutical Research And Development
Curated by ChEMBL
LigandPNGBDBM50400822(CHEMBL2205028)
Affinity DataIC50: >4.00E+4nM. Assay description: Inhibition of HER2
In DepthDetails ArticlePubMed