BDBM50400841 CHEMBL2205681
SMILES C[C@]12CC[C@H]3[C@@H](CCc4cc(O)ccc34)[C@@H]1Cc1cn[nH]c21
InChI Key InChIKey=LYPKZGCWSASPDL-VXNCWWDNSA-N
Data  1 KI
  Tab Delimited (TSV)   2D SDfile   Computed 3D by Vconf -m prep SDfile
Find this compound or compounds like it in BindingDB:
Activity Spreadsheet -- Enzyme Inhibition Constant Data from BindingDB
Found 1 hit for monomerid = 50400841
Target17-beta-hydroxysteroid dehydrogenase type 1(Homo sapiens (Human))
Bristol-Myers Squibb Pharmaceutical Research And Development
Curated by ChEMBL
LigandPNGBDBM50400841(CHEMBL2205681)
Affinity DataKi:  4.08E+3nM. Assay description: Inhibition of human estradiol 17beta-dehydrogenase
In DepthDetails ArticlePubMed