BDBM50400874 CHEMBL2086410
SMILES NC(=O)[C@H](CN1CCC2(CC1)OCCc1cc(F)sc21)Cc1ccccc1F
InChI Key InChIKey=SUUMGONLDXRRSA-INIZCTEOSA-N
Data  2 KI
  Tab Delimited (TSV)   2D SDfile   Computed 3D by Vconf -m prep SDfile
Find this compound or compounds like it in BindingDB:
Activity Spreadsheet -- Enzyme Inhibition Constant Data from BindingDB
Found 2 hits for monomerid = 50400874
TargetNociceptin receptor(Homo sapiens (Human))
National Institute Of Mental Health
Curated by ChEMBL
LigandPNGBDBM50400874(CHEMBL2086410)
Affinity DataKi:  0.106nM. Assay description: Displacement of [3H]nociceptin from human recombinant NOP receptor expressed in CHO cells after 60 mins by microbeta scintillation counting
In DepthDetails ArticlePubMed
TargetNociceptin receptor(Homo sapiens (Human))
National Institute Of Mental Health
Curated by ChEMBL
LigandPNGBDBM50400874(CHEMBL2086410)
Affinity DataKi:  0.106nM. Assay description: Agonist activity at human cloned NOP receptor expressed in CHO cell membranes after 30 mins by [35S]GTPgammaS binding assay
In DepthDetails ArticlePubMed