BDBM50402058 CHEMBL2205427
SMILES COc1cc(Nc2nccc(Nc3c(N[C@H](C)C(C)(C)C)c(=O)c3=O)n2)cc(OC)c1OC
InChI Key InChIKey=MVZRHVDFODTTPE-GFCCVEGCSA-N
Data  1 KI
  Tab Delimited (TSV)   2D SDfile   Computed 3D by Vconf -m prep SDfile
Find this compound or compounds like it in BindingDB:
Activity Spreadsheet -- Enzyme Inhibition Constant Data from BindingDB
Found 1 hit for monomerid = 50402058
TargetSerine/threonine-protein kinase PLK1(Homo sapiens (Human))
Abbott Laboratories
Curated by ChEMBL
LigandPNGBDBM50402058(CHEMBL2205427)
Affinity DataKi:  234nM. Assay description: Inhibition of PLK1 in human MIAPaCa2 cells after 48 hrs by MTT assay
In DepthDetails ArticlePubMed