BDBM50402061 CHEMBL2205436
SMILES C[C@@H](Nc1c(Nc2ccnc(Nc3ccc4OCOc4c3)n2)c(=O)c1=O)C(C)(C)C
InChI Key InChIKey=SYIDJVCIQZEKSO-LLVKDONJSA-N
Data  1 KI
  Tab Delimited (TSV)   2D SDfile   Computed 3D by Vconf -m prep SDfile
Find this compound or compounds like it in BindingDB:
Activity Spreadsheet -- Enzyme Inhibition Constant Data from BindingDB
Found 1 hit for monomerid = 50402061
TargetSerine/threonine-protein kinase PLK1(Homo sapiens (Human))
Abbott Laboratories
Curated by ChEMBL
LigandPNGBDBM50402061(CHEMBL2205436)
Affinity DataKi:  165nM. Assay description: Inhibition of PLK1 in human MIAPaCa2 cells after 48 hrs by MTT assay
In DepthDetails ArticlePubMed