BDBM50403534 CHEMBL342854
SMILES COc1ccc(COC(=O)C2=CSC3CC(=O)N23)cc1
InChI Key InChIKey=OKODZAMMZXTLOD-UHFFFAOYSA-N
Data  1 IC50
  Tab Delimited (TSV)   2D SDfile   Computed 3D by Vconf -m prep SDfile
Find this compound or compounds like it in BindingDB:
Activity Spreadsheet -- Enzyme Inhibition Constant Data from BindingDB
Found 1 hit for monomerid = 50403534
TargetLysine-specific histone demethylase 1A(Homo sapiens (Human))TBA
LigandPNGBDBM50403534(CHEMBL5280652)
Affinity DataIC50:  700nM. Assay description: Tested for antagonist activity at NK-2 tachykinin receptors in hamster trachea
In DepthDetails