BDBM50403595 CHEMBL2112402
SMILES OC(=O)[C@@H]1Cc2cccc3CC[C@H](NC(=O)C(CS)Cc4ccc(cc4)-c4ccccc4)C(=O)N1c23
InChI Key InChIKey=FTZIHGUFMWZVIM-DJHGOXGWSA-N
Data  4 IC50
  Tab Delimited (TSV)   2D SDfile   Computed 3D by Vconf -m prep SDfile
Find this compound or compounds like it in BindingDB:
Activity Spreadsheet -- Enzyme Inhibition Constant Data from BindingDB
Found 4 hits for monomerid = 50403595
TargetNeprilysin(Homo sapiens (Human))
TBA
Curated by ChEMBL
LigandPNGBDBM50403595(CHEMBL2112402)
Affinity DataIC50:  15nM. Assay description: Inhibition of Angiotensin I converting enzyme
In DepthDetails Article
TargetNeprilysin(Homo sapiens (Human))
TBA
Curated by ChEMBL
LigandPNGBDBM50403595(CHEMBL2112402)
Affinity DataIC50:  15nM. Assay description: Inhibition of neutral endopeptidase
In DepthDetails Article
TargetAngiotensin-converting enzyme 2(Homo sapiens (Human))
TBA
Curated by ChEMBL
LigandPNGBDBM50403595(CHEMBL2112402)
Affinity DataIC50:  77nM. Assay description: Inhibition of Angiotensin I converting enzyme
In DepthDetails Article
TargetAngiotensin-converting enzyme 2(Homo sapiens (Human))
TBA
Curated by ChEMBL
LigandPNGBDBM50403595(CHEMBL2112402)
Affinity DataIC50:  77nM. Assay description: Inhibition of Angiotensin I converting enzyme
In DepthDetails Article