BDBM50403993 CHEMBL91418
SMILES Cc1cc(C)cc(OCC(=O)N(C2CCNCC2)c2ccc(Cl)c(Cl)c2)c1
InChI Key InChIKey=PNZBIKULWBRCFZ-UHFFFAOYSA-N
Data  2 KI  2 IC50
  Tab Delimited (TSV)   2D SDfile   Computed 3D by Vconf -m prep SDfile
Find this compound or compounds like it in BindingDB:
Activity Spreadsheet -- Enzyme Inhibition Constant Data from BindingDB
Found 4 hits for monomerid = 50403993
TargetSubstance-P receptor(Homo sapiens (Human))
Organon Laboratories
Curated by ChEMBL
LigandPNGBDBM50403993(CHEMBL91418)
Affinity DataKi:  25nM. Assay description: Negative logarithm causing 50% receptor occupancy against tachykinin receptor 1
In DepthDetails ArticlePubMed
TargetSodium-dependent serotonin transporter(Homo sapiens (Human))
Organon Laboratories
Curated by ChEMBL
LigandPNGBDBM50403993(CHEMBL91418)
Affinity DataKi:  32nM. Assay description: Negative logarithm causing 50% receptor occupancy against serotonin transporter
In DepthDetails ArticlePubMed
TargetSubstance-P receptor(Homo sapiens (Human))
Organon Laboratories
Curated by ChEMBL
LigandPNGBDBM50403993(CHEMBL91418)
Affinity DataIC50:  25nM. Assay description: Binding affinity at human Tachykinin receptor 1 expressed in CHO cells by [3H]-substance P displacement.
In DepthDetails ArticlePubMed
TargetSodium-dependent serotonin transporter(Rattus norvegicus (rat))
Ucb Pharma
Curated by ChEMBL
LigandPNGBDBM50403993(CHEMBL91418)
Affinity DataIC50:  32nM. Assay description: Binding affinity at serotonin transporter from rat cerebral cortex by [3H]-paroxetine displacement.
In DepthDetails ArticlePubMed