BDBM504044 US11034692, Compound 313
SMILES Cc1ccncc1-c1cc2cc(NC(=O)[C@H]3C[C@]33CCNC(=O)C3)ncc2c(N)n1
InChI Key InChIKey=VJXZPHDFUZPIGW-ZHRRBRCNSA-N
Data  1 KI
  Tab Delimited (TSV)   2D SDfile   Computed 3D by Vconf -m prep SDfile
Find this compound or compounds like it in BindingDB:
Activity Spreadsheet -- Enzyme Inhibition Constant Data from BindingDB
Found 1 hit for monomerid = 504044
TargetMitogen-activated protein kinase kinase kinase kinase 1(Homo sapiens (Human))
Genentech
US Patent
LigandPNGBDBM504044(US11034692, Compound 313)
Affinity DataKi:  0.0200nM. Assay description: Lanth: For the binding assay, 4 ul 2×HPK1 and Eu-anti-GST antibody were added to each well of the assay plate using a Multidrop reagent dispenser. Th...
Ligand InfoPC cidPC sid
In DepthDetails US Patent