BDBM50404763 CHEMBL283289
SMILES CCOC(=O)CCNCC(O)COc1ccccc1C
InChI Key InChIKey=NWWUPEBIDWICHJ-UHFFFAOYSA-N
Data  3 Kd
  Tab Delimited (TSV)   2D SDfile   Computed 3D by Vconf -m prep SDfile
Find this compound or compounds like it in BindingDB:
Activity Spreadsheet -- Enzyme Inhibition Constant Data from BindingDB
Found 3 hits for monomerid = 50404763
TargetBeta-1 adrenergic receptor(GUINEA PIG)
TBA
Curated by ChEMBL
LigandPNGBDBM50404763(CHEMBL283289)
Affinity DataKd:  32nM. Assay description: In vitro ability to block beta-1 adrenergic receptor in guinea pig right atria.
In DepthDetails ArticlePubMed
TargetBeta-2 adrenergic receptor(GUINEA PIG)
TBA
Curated by ChEMBL
LigandPNGBDBM50404763(CHEMBL283289)
Affinity DataKd:  39.8nM. Assay description: In vitro ability to block beta-2 adrenergic receptor in guinea pig trachea.
In DepthDetails ArticlePubMed
TargetBeta-1 adrenergic receptor(GUINEA PIG)
TBA
Curated by ChEMBL
LigandPNGBDBM50404763(CHEMBL283289)
Affinity DataKd:  0.0000100nM. Assay description: In vivo inihibition of Beta-1 adrenergic receptor in guinea pig right atria after 40 min
In DepthDetails ArticlePubMed