BDBM50404870 CHEMBL350836
SMILES OC(=O)c1ccc2nc3ccc(O)cc3c(=O)n2c1
InChI Key InChIKey=XGVHFMCIAPRAIT-UHFFFAOYSA-N
Data  2 IC50
  Tab Delimited (TSV)   2D SDfile   Computed 3D by Vconf -m prep SDfile
Find this compound or compounds like it in BindingDB:
Activity Spreadsheet -- Enzyme Inhibition Constant Data from BindingDB
Found 2 hits for monomerid = 50404870
TargetAlkaline phosphatase, germ cell type(Homo sapiens (Human))
TBA
Curated by ChEMBL
LigandPNGBDBM50404870(CHEMBL350836)
Affinity DataIC50:  2.80E+5nM. Assay description: 50% inhibition of human placental alkaline phosphatase in the presence of 10 mM p-nitrophenyl phosphate as substrate
In DepthDetails ArticlePubMed
TargetAlkaline phosphatase, tissue-nonspecific isozyme(Rattus norvegicus)
TBA
Curated by ChEMBL
LigandPNGBDBM50404870(CHEMBL350836)
Affinity DataIC50:  3.40E+5nM. Assay description: Concentration required for 50% inhibition of human leukocyte alkaline phosphatase in the presence of 10 mM p-nitrophenyl phosphate as substrate
In DepthDetails ArticlePubMed