BDBM50405501 CHEMBL57582
SMILES CCc1cc(Cc2cnc(N)nc2N)cc(CC)c1CC
InChI Key InChIKey=FWGBYLOVKFIONM-UHFFFAOYSA-N
Data  3 KI
  Tab Delimited (TSV)   2D SDfile   Computed 3D by Vconf -m prep SDfile
Find this compound or compounds like it in BindingDB:
Activity Spreadsheet -- Enzyme Inhibition Constant Data from BindingDB
Found 3 hits for monomerid = 50405501
TargetDihydrofolate reductase(Salmonella enterica subsp. enterica serovar Typhi)
Pomona College
Curated by ChEMBL
LigandPNGBDBM50405501(CHEMBL57582)
Affinity DataKi:  15nM. Assay description: Inhibitory activity against Escherichia coli dihydrofolate reductase
In DepthDetails ArticlePubMed
TargetDihydrofolate reductase(Lactobacillus casei)
Pomona College
Curated by ChEMBL
LigandPNGBDBM50405501(CHEMBL57582)
Affinity DataKi:  132nM. Assay description: Inhibitory activity against Lactobacillus casei dihydrofolate reductase
In DepthDetails ArticlePubMed
TargetDihydrofolate reductase(Gallus gallus (Chicken))
Pomona College
Curated by ChEMBL
LigandPNGBDBM50405501(CHEMBL57582)
Affinity DataKi:  5.62E+3nM. Assay description: Inhibitory activity against chicken liver dihydrofolate reductase
In DepthDetails ArticlePubMed