BDBM50405612 CHEMBL2051934
SMILES N[C@@H]1CCc2ccccc2[C@@H]1O
InChI Key InChIKey=IIMSEFZOOYSTDO-ZJUUUORDSA-N
Data  1 KI
  Tab Delimited (TSV)   2D SDfile   Computed 3D by Vconf -m prep SDfile
Find this compound or compounds like it in BindingDB:
Activity Spreadsheet -- Enzyme Inhibition Constant Data from BindingDB
Found 1 hit for monomerid = 50405612
TargetPhenylethanolamine N-methyltransferase(Bos taurus (bovine))
University Of Kansas
Curated by ChEMBL
LigandPNGBDBM50405612(CHEMBL2051934)
Affinity DataKi:  2.93E+5nM. Assay description: In vitro binding affinity of compound towards bovine adrenal phenylethanolamine N-methyl-transferase (PNMT)
In DepthDetails ArticlePubMed