BDBM50406422 CHEMBL2115381
SMILES CCCCCCCCCCCCCCCCCCOC1C(=O)O[C@H](C(O)CO)C1=O
InChI Key InChIKey=ZFYFCSHQQNPMLF-GTMAMOSYSA-N
Data  1 IC50
  Tab Delimited (TSV)   2D SDfile   Computed 3D by Vconf -m prep SDfile
Find this compound or compounds like it in BindingDB:
Activity Spreadsheet -- Enzyme Inhibition Constant Data from BindingDB
Found 1 hit for monomerid = 50406422
TargetPolyunsaturated fatty acid 5-lipoxygenase(Rattus norvegicus)
Takeda Chemical Industries
Curated by ChEMBL
LigandPNGBDBM50406422(CHEMBL2115381)
Affinity DataIC50:  4.30nM. Assay description: Reduction of lipid peroxide formed in rat brain homogenates.
In DepthDetails ArticlePubMed