BDBM50406534 CHEMBL50960
SMILES CNC=Nc1ccc(cc1)-c1c[nH]cn1
InChI Key InChIKey=ATPATFRGZLKLMA-UHFFFAOYSA-N
Data  1 Kd
  Tab Delimited (TSV)   2D SDfile   Computed 3D by Vconf -m prep SDfile
Find this compound or compounds like it in BindingDB:
Activity Spreadsheet -- Enzyme Inhibition Constant Data from BindingDB
Found 1 hit for monomerid = 50406534
TargetToll-like receptor 2(Homo sapiens (Human))TBA
LigandPNGBDBM50406534(CHEMBL5291186)
Affinity DataEC50:  33nM. Assay description: Antagonism of phenylephrine stimulated contraction of the rat isolated spleen.
In DepthDetails