BDBM50406642 CHEMBL72193
SMILES Nc1ccc(cc1I)C(=O)NCCNC(NCCCOc1cccc(CN2CCCCC2)c1)=NC#N
InChI Key InChIKey=VJTYCMQYDRXNNY-UHFFFAOYSA-N
Data  1 KI
  Tab Delimited (TSV)   2D SDfile   Computed 3D by Vconf -m prep SDfile
Find this compound or compounds like it in BindingDB:
Activity Spreadsheet -- Enzyme Inhibition Constant Data from BindingDB
Found 1 hit for monomerid = 50406642
TargetHistamine H2 receptor(Cavia porcellus (domestic guinea pig))
Freie Universit£T Berlin
Curated by ChEMBL
LigandPNGBDBM50406642(CHEMBL72193)
Affinity DataKi:  0.708nM. Assay description: Inhibition of [125I]APT binding to histamine H2 receptor in guinea pig cerebral membranes.
In DepthDetails ArticlePubMed