BDBM50406695 CHEMBL2112656
SMILES C[C@@H]1NC(=O)[C@@H](Cc2ccccc2)NC(=O)[C@@H]2CCCN2C(=O)[C@H](Cc2ccccc2)N(C)C(=O)[C@@H]2CCCCN2C(=O)[C@H]2CCCCN2C1=O
InChI Key InChIKey=JERDGULXMFCRDK-GLJCIFSQSA-N
Data  1 IC50
  Tab Delimited (TSV)   2D SDfile   Computed 3D by Vconf -m prep SDfile
Find this compound or compounds like it in BindingDB:
Activity Spreadsheet -- Enzyme Inhibition Constant Data from BindingDB
Found 1 hit for monomerid = 50406695
TargetOxytocin receptor(RAT)
Merck Research Laboratories
Curated by ChEMBL
LigandPNGBDBM50406695(CHEMBL2112656)
Affinity DataIC50:  3.00E+4nM. Assay description: Concentration required to displace 50% of [3H]oxytocin from rat uterine receptor.
In DepthDetails ArticlePubMed