BDBM50407978 CHEMBL2112759
SMILES CC(=O)[C@@]12O[C@@H]1C[C@H]1[C@@H]3CCC4=CC(=O)CC[C@]4(C)[C@H]3CC[C@]21C
InChI Key InChIKey=LHNVKVKZPHUYQO-SRWWVFQWSA-N
Data  2 IC50
  Tab Delimited (TSV)   2D SDfile   Computed 3D by Vconf -m prep SDfile
Find this compound or compounds like it in BindingDB:
Activity Spreadsheet -- Enzyme Inhibition Constant Data from BindingDB
Found 2 hits for monomerid = 50407978
TargetSteroid 17-alpha-hydroxylase/17,20 lyase(Homo sapiens (Human))
University Of Maryland
Curated by ChEMBL
LigandPNGBDBM50407978(CHEMBL2112759)
Affinity DataIC50:  800nM. Assay description: Inhibition of human testicular 17-alpha-hydroxylase
In DepthDetails ArticlePubMed
TargetSteroid 17-alpha-hydroxylase/17,20 lyase(Homo sapiens (Human))
University Of Maryland
Curated by ChEMBL
LigandPNGBDBM50407978(CHEMBL2112759)
Affinity DataIC50:  800nM. Assay description: Inhibition of human testicular 17-alpha-hydroxylase
In DepthDetails ArticlePubMed