BDBM50408519 CHEMBL115357
SMILES CC(C)C[C@H](NC(=O)OCc1ccccc1)C(=O)NNC(=O)NNC(=O)[C@H](CC(C)C)NC(=O)OCc1ccccc1
InChI Key InChIKey=HGDUWJVGIGLVOH-ZEQRLZLVSA-N
Data  2 KI
PDB links: 1 PDB ID matches this monomer.
  Tab Delimited (TSV)   2D SDfile   Computed 3D by Vconf -m prep SDfile
Find this compound or compounds like it in BindingDB:
Activity Spreadsheet -- Enzyme Inhibition Constant Data from BindingDB
Found 2 hits for monomerid = 50408519
TargetCathepsin K(Homo sapiens (Human))
Smithkline Beecham Pharmaceuticals
Curated by ChEMBL
LigandPNGBDBM50408519(CHEMBL115357)
Affinity DataKi:  0.700nM. Assay description: Relative binding affinity was measured for Cathepsin K
In DepthDetails ArticlePubMed
TargetCathepsin K(Homo sapiens (Human))
Smithkline Beecham Pharmaceuticals
Curated by ChEMBL
LigandPNGBDBM50408519(CHEMBL115357)
Affinity DataKi:  0.700nM. Assay description: Inhibition of human cathepsin K
In DepthDetails ArticlePubMed