BDBM50408523 CHEMBL2079714
SMILES [NH-]C(=O)c1ccc[n+](CC(=O)N2CC[C@@H]3[C@H]2C(=O)N3S([O-])(=O)=O)c1
InChI Key InChIKey=BYNLIVLZZWTJLF-KOLCDFICSA-M
Data  2 IC50  2 Koff  2 Kon
  Tab Delimited (TSV)   2D SDfile   Computed 3D by Vconf -m prep SDfile
Find this compound or compounds like it in BindingDB:
Activity Spreadsheet -- Enzyme Inhibition Constant Data from BindingDB
Found 5 hits for monomerid = 50408523
TargetBeta-lactamase(Escherichia coli)
F. Hoffmann-La Roche
Curated by ChEMBL
LigandPNGBDBM50408523(CHEMBL2079714)
Affinity DataIC50:  700nM. Assay description: Inhibitory activity against Escherichia coli TEM-3 Beta-lactamase
In DepthDetails ArticlePubMed
TargetBeta-lactamase(Pseudomonas aeruginosa (PAO1))
F. Hoffmann-La Roche
Curated by ChEMBL
LigandPNGBDBM50408523(CHEMBL2079714)
Affinity DataKon:  0.00000900M-1s-1 Koff:  0.900s-1Assay Description:Deacylation of 18SH Beta-lactamase of Pseudomonas aeruginosa
In DepthDetails ArticlePubMed
TargetBeta-lactamase(Pseudomonas aeruginosa (PAO1))
F. Hoffmann-La Roche
Curated by ChEMBL
LigandPNGBDBM50408523(CHEMBL2079714)
Affinity DataIC50:  27nM. Assay description: Inhibition of P. aeruginosa 18SH Beta-lactamase.
In DepthDetails ArticlePubMed
TargetBeta-lactamase(Pseudomonas aeruginosa (PAO1))
F. Hoffmann-La Roche
Curated by ChEMBL
LigandPNGBDBM50408523(CHEMBL2079714)
Affinity DataKon:  0.00000900M-1s-1Assay Description:Time taken for deacylation of Pseudomonas aeruginosa 18SH Beta-lactamase
In DepthDetails ArticlePubMed
TargetBeta-lactamase(Pseudomonas aeruginosa (PAO1))
F. Hoffmann-La Roche
Curated by ChEMBL
LigandPNGBDBM50408523(CHEMBL2079714)
Affinity DataKoff:  0.900s-1Assay Description:Acylation of Pseudomonas aeruginosa 18SH Beta-lactamase
In DepthDetails ArticlePubMed