BDBM50409502 CHEMBL325253
SMILES Fc1ccc(cc1)C(=O)CCCN1CCN(CC2Cc3sccc3C(=O)C2)CC1
InChI Key InChIKey=LGAZBHZJAUYBTQ-UHFFFAOYSA-N
Data  5 KI
  Tab Delimited (TSV)   2D SDfile   Computed 3D by Vconf -m prep SDfile
Find this compound or compounds like it in BindingDB:
Activity Spreadsheet -- Enzyme Inhibition Constant Data from BindingDB
Found 5 hits for monomerid = 50409502
Target5-hydroxytryptamine receptor 2A(Rattus norvegicus (rat))
Universidad De Santiago
Curated by ChEMBL
LigandPNGBDBM50409502(CHEMBL325253)
Affinity DataKi:  107nM. Assay description: In vitro ability to displace [3H]ketanserin binding from 5-hydroxytryptamine 2A receptor in rat striatal membrane.
In DepthDetails ArticlePubMed
Target5-hydroxytryptamine receptor 2A(Rattus norvegicus (rat))
Universidad De Santiago
Curated by ChEMBL
LigandPNGBDBM50409502(CHEMBL325253)
Affinity DataKi:  107nM. Assay description: Kinetic inhibition constant evaluated by measuring serotonergic activity
In DepthDetails ArticlePubMed
TargetD(2) dopamine receptor(Rattus norvegicus (rat))
Universidad De Santiago
Curated by ChEMBL
LigandPNGBDBM50409502(CHEMBL325253)
Affinity DataKi:  269nM. Assay description: In vitro ability to displace [3H]spiperone binding from dopamine receptor D2 in rat striatal membrane.
In DepthDetails ArticlePubMed
TargetD(1A) dopamine receptor(RAT)
Universidad De Santiago
Curated by ChEMBL
LigandPNGBDBM50409502(CHEMBL325253)
Affinity DataKi:  1.35E+3nM. Assay description: In vitro ability to displace [3H]SCH-23390 binding from Dopamine 1 (D1) receptor in rat striatal membrane.
In DepthDetails ArticlePubMed
Target5-hydroxytryptamine receptor 2C(Homo sapiens (Human))
Universidad De Santiago
Curated by ChEMBL
LigandPNGBDBM50409502(CHEMBL325253)
Affinity DataKi:  3.98E+3nM. Assay description: In vitro ability to displace [3H]mesulergine binding from 5-hydroxytryptamine 2C receptor from bovine choroid plexus.
In DepthDetails ArticlePubMed