BDBM50409516 CHEMBL95112
SMILES Fc1ccc(cc1)C(=O)CCCN1CCN(CCC2Cc3sccc3C2=O)CC1
InChI Key InChIKey=AFYKQUVNHCGGNK-UHFFFAOYSA-N
Data  4 KI
  Tab Delimited (TSV)   2D SDfile   Computed 3D by Vconf -m prep SDfile
Find this compound or compounds like it in BindingDB:
Activity Spreadsheet -- Enzyme Inhibition Constant Data from BindingDB
Found 4 hits for monomerid = 50409516
Target5-hydroxytryptamine receptor 2A(Rattus norvegicus (rat))
Universidad De Santiago
Curated by ChEMBL
LigandPNGBDBM50409516(CHEMBL95112)
Affinity DataKi:  43nM. Assay description: In vitro ability to displace [3H]ketanserin binding from 5-hydroxytryptamine 2A receptor in rat striatal membrane.
In DepthDetails ArticlePubMed
TargetD(2) dopamine receptor(Rattus norvegicus (rat))
Universidad De Santiago
Curated by ChEMBL
LigandPNGBDBM50409516(CHEMBL95112)
Affinity DataKi:  263nM. Assay description: In vitro ability to displace [3H]spiperone binding from dopamine receptor D2 in rat striatal membrane.
In DepthDetails ArticlePubMed
TargetD(1A) dopamine receptor(RAT)
Universidad De Santiago
Curated by ChEMBL
LigandPNGBDBM50409516(CHEMBL95112)
Affinity DataKi:  324nM. Assay description: In vitro ability to displace [3H]SCH-23390 binding from Dopamine receptor D1 in rat striatal membrane.
In DepthDetails ArticlePubMed
Target5-hydroxytryptamine receptor 2C(Homo sapiens (Human))
Universidad De Santiago
Curated by ChEMBL
LigandPNGBDBM50409516(CHEMBL95112)
Affinity DataKi:  1.26E+3nM. Assay description: In vitro ability to displace [3H]mesulergine binding from 5-hydroxytryptamine 2C receptor from bovine choroid plexus.
In DepthDetails ArticlePubMed