BDBM50410612 CHEMBL200166
SMILES CN1CCC(C)(CC1)c1nc(cs1)-c1ccc(cc1)C(=O)NC1(CCCCC1)C(=O)NCC#N
InChI Key InChIKey=NXSZCSJUPBDVTG-UHFFFAOYSA-N
Data  1 KI
  Tab Delimited (TSV)   2D SDfile   Computed 3D by Vconf -m prep SDfile
Find this compound or compounds like it in BindingDB:
Activity Spreadsheet -- Enzyme Inhibition Constant Data from BindingDB
Found 1 hit for monomerid = 50410612
TargetCathepsin K(Oryctolagus cuniculus (rabbit))
Celera Genomics
Curated by ChEMBL
LigandPNGBDBM50410612(CHEMBL200166)
Affinity DataKi:  0.950nM. Assay description: Inhibitory constant against rabbit cathepsin K using Z-Phe-Arg-AMC substrate
In DepthDetails ArticlePubMed