BDBM50410641 CHEMBL2113213
SMILES CC(C)(C)c1ccc(cc1)S(=O)(=O)N(CC(=O)NN=C1C(=O)Nc2ccccc12)c1ccc(Cl)cc1
InChI Key InChIKey=IJNSLJVDMQFOPU-UHFFFAOYSA-N
Data  1 KI
  Tab Delimited (TSV)   2D SDfile   Computed 3D by Vconf -m prep SDfile
Find this compound or compounds like it in BindingDB:
Activity Spreadsheet -- Enzyme Inhibition Constant Data from BindingDB
Found 1 hit for monomerid = 50410641
TargetOxytocin receptor(Homo sapiens (Human))
Serono Pharmaceutical Research Institute
Curated by ChEMBL
LigandPNGBDBM50410641(CHEMBL2113213)
Affinity DataKi:  61nM. Assay description: Displacement of [125I]OVTA antagonist from human oxytocin receptor expressed in HEK293-EBNA cells
In DepthDetails ArticlePubMed