BDBM50411017 CHEMBL539603
SMILES NCCCC[C@H](NC(=O)c1ccc(F)cc1F)C(=O)c1noc(Cc2ccc(OCCc3ccc(Cl)c(Cl)c3)cc2)n1
InChI Key InChIKey=ACIRAJIHJQLJDI-SANMLTNESA-N
Data  1 KI
  Tab Delimited (TSV)   2D SDfile   Computed 3D by Vconf -m prep SDfile
Find this compound or compounds like it in BindingDB:
Activity Spreadsheet -- Enzyme Inhibition Constant Data from BindingDB
Found 1 hit for monomerid = 50411017
TargetTryptase beta-2(Homo sapiens (Human))
Celera Genomics
Curated by ChEMBL
LigandPNGBDBM50411017(CHEMBL539603)
Affinity DataKi:  3.25nM. Assay description: Inhibition of human B tryptase
In DepthDetails ArticlePubMed