BDBM50411352 CHEMBL242934
SMILES COc1cc2nc(nc(N)c2cc1OC)N1CCN([C@H]2CCCC[C@@H]12)C(=O)c1ccccc1
InChI Key InChIKey=LHLZWQUFUNHDHT-VQTJNVASSA-N
Data  1 Kd
  Tab Delimited (TSV)   2D SDfile   Computed 3D by Vconf -m prep SDfile
Find this compound or compounds like it in BindingDB:
Activity Spreadsheet -- Enzyme Inhibition Constant Data from BindingDB
Found 2 hits for monomerid = 50411352
TargetHistone deacetylase 6(Homo sapiens (Human))TBA
LigandPNGBDBM50411352(CHEMBL5285743)
Affinity DataKd: >4.80E+5nM. Assay description: Displacement of [125I]angiotensin 2 from type-1 angiotensin 2 receptor in Bos taurus (bovine) adrenal cortical membrane
In DepthDetails
TargetUbiquitin carboxyl-terminal hydrolase 5(Homo sapiens (Human))TBA
LigandPNGBDBM50411352(CHEMBL5285743)
Affinity DataKd:  1.30E+5nM. Assay description: Inhibition of carbonic anhydrase 2 assessed as inhibition of carbon dioxide hydration
In DepthDetails