BDBM50411397 CHEMBL243708
SMILES Cc1cc(no1)-c1ccc2CCN(CCCSc3nnc(-c4ccc5nc(C)c(C)nc5c4)n3C)CCc2c1
InChI Key InChIKey=VSUKSHADZRDBII-UHFFFAOYSA-N
Data  1 IC50
  Tab Delimited (TSV)   2D SDfile   Computed 3D by Vconf -m prep SDfile
Find this compound or compounds like it in BindingDB:
Activity Spreadsheet -- Enzyme Inhibition Constant Data from BindingDB
Found 1 hit for monomerid = 50411397
TargetPotassium voltage-gated channel subfamily H member 2(Homo sapiens (Human))
Glaxosmithkline
Curated by ChEMBL
LigandPNGBDBM50411397(CHEMBL243708)
Affinity DataIC50:  316nM. Assay description: Displacement of [3H]dofetilide from hERG expressed in CHO cells
In DepthDetails ArticlePubMed