BDBM50411401 CHEMBL243859
SMILES Cc1cc(no1)-c1ccc2CCN(CCCSc3nnc(C4CCCC4)n3C)CCc2c1
InChI Key InChIKey=GRQQDQSHIQXVLZ-UHFFFAOYSA-N
Data  1 IC50
  Tab Delimited (TSV)   2D SDfile   Computed 3D by Vconf -m prep SDfile
Find this compound or compounds like it in BindingDB:
Activity Spreadsheet -- Enzyme Inhibition Constant Data from BindingDB
Found 1 hit for monomerid = 50411401
TargetPotassium voltage-gated channel subfamily H member 2(Homo sapiens (Human))
Glaxosmithkline
Curated by ChEMBL
LigandPNGBDBM50411401(CHEMBL243859)
Affinity DataIC50:  794nM. Assay description: Displacement of [3H]dofetilide from hERG expressed in CHO cells
In DepthDetails ArticlePubMed