BDBM50411911 CHEMBL270644
SMILES CCCc1c(O)c(C)c(=O)[nH]c1CCC(C)CCCC(C)C
InChI Key InChIKey=SUXQILONEZLJOV-UHFFFAOYSA-N
Data  1 IC50
  Tab Delimited (TSV)   2D SDfile   Computed 3D by Vconf -m prep SDfile
Find this compound or compounds like it in BindingDB:
Activity Spreadsheet -- Enzyme Inhibition Constant Data from BindingDB
Found 1 hit for monomerid = 50411911
TargetAcyl carrier protein, mitochondrial(Bos taurus)
Georg-August-Universit£T G£Ttingen
Curated by ChEMBL
LigandPNGBDBM50411911(CHEMBL270644)
Affinity DataIC50:  2.21E+3nM. Assay description: Inhibition of NADH-ubiquinone oxidoreductase assessed as NADH oxidase activity in bovine heart submitochondrial particles
In DepthDetails ArticlePubMed