BDBM50411912 IROMYCIN D
SMILES CCCc1c(C\C=C(/C)C\C=C\C(C)O)[nH]c(=O)c(C)c1O
InChI Key InChIKey=IZJCLXWPUMBGDF-LWGDNYCUSA-N
Data  1 IC50
  Tab Delimited (TSV)   2D SDfile   Computed 3D by Vconf -m prep SDfile
Find this compound or compounds like it in BindingDB:
Activity Spreadsheet -- Enzyme Inhibition Constant Data from BindingDB
Found 1 hit for monomerid = 50411912
TargetAcyl carrier protein, mitochondrial(Bos taurus)
Georg-August-Universit£T G£Ttingen
Curated by ChEMBL
LigandPNGBDBM50411912(IROMYCIN D)
Affinity DataIC50: >2.65E+4nM. Assay description: Inhibition of NADH-ubiquinone oxidoreductase assessed as NADH oxidase activity in bovine heart submitochondrial particles
In DepthDetails ArticlePubMed