BDBM50411946 CHEMBL401923
SMILES CCCn1c(CC)nnc1C12CC3CC(CC(C3)C1)C2
InChI Key InChIKey=DDOJIBSTOYHQRM-UHFFFAOYSA-N
Data  1 IC50
  Tab Delimited (TSV)   2D SDfile   Computed 3D by Vconf -m prep SDfile
Find this compound or compounds like it in BindingDB:
Activity Spreadsheet -- Enzyme Inhibition Constant Data from BindingDB
Found 1 hit for monomerid = 50411946
Target11-beta-hydroxysteroid dehydrogenase 1(Homo sapiens (Human))
Korea Research Institute Of Chemical Technology
Curated by ChEMBL
LigandPNGBDBM50411946(CHEMBL401923)
Affinity DataIC50:  11.0nM. Assay description: Inhibition of 11beta-HSD1
In DepthDetails ArticlePubMed