BDBM50412381 CHEMBL609098
SMILES OC1C(COS(=O)(=O)NC(=O)c2ccccc2O)OC(C1O)n1cnc2c1nc[nH]c2=O
InChI Key InChIKey=BUAZXZGGMUEXRD-UHFFFAOYSA-N
Data  1 KI
  Tab Delimited (TSV)   2D SDfile   Computed 3D by Vconf -m prep SDfile
Find this compound or compounds like it in BindingDB:
Activity Spreadsheet -- Enzyme Inhibition Constant Data from BindingDB
Found 1 hit for monomerid = 50412381
TargetSalicyl-AMP ligase / salicyl-S-ArCP synthetase(Mycobacterium tuberculosis)
University Of Minnesota
Curated by ChEMBL
LigandPNGBDBM50412381(CHEMBL609098)
Affinity DataKi:  800nM. Assay description: Inhibition of Mycobacterium tuberculosis recombinant MbtA expressed in Escherichia coli by ATP-PPi exchange assay
In DepthDetails ArticlePubMed