BDBM50412550 CHEMBL479626
SMILES CCCCc1nc2cc(ccc2n1Cc1ccc(cc1)-c1ccccc1C(O)=O)S(=O)(=O)NCCC
InChI Key InChIKey=PQEIYRUUBFTDMP-UHFFFAOYSA-N
Data  1 Kd
  Tab Delimited (TSV)   2D SDfile   Computed 3D by Vconf -m prep SDfile
Find this compound or compounds like it in BindingDB:
Activity Spreadsheet -- Enzyme Inhibition Constant Data from BindingDB
Found 2 hits for monomerid = 50412550
TargetD(3) dopamine receptor(Homo sapiens)TBA
LigandPNGBDBM50412550(CHEMBL5286161)
Affinity DataKi:  22nM. Assay description: Apparent binding affinity to FKBP12 PPI domain (unknown origin) in PBS at pH 7 by fluorescence spectrophotometric analysis relative to FK506
In DepthDetails
TargetD(2) dopamine receptor(Homo sapiens (Human))TBA
LigandPNGBDBM50412550(CHEMBL5286161)
Affinity DataKi:  49nM. Assay description: Inhibition of acetylcholinesterase in Rattus norvegicus (rat) cortex by Ellman method
In DepthDetails