BDBM50413072 CHEMBL495703
SMILES C[C@H]1CN(CCN1CCc1ccc2OCC(=O)Nc2c1)c1cccc2nc(C)ccc12
InChI Key InChIKey=DZBLKVHBOHYUNY-SFHVURJKSA-N
Data  4 KI
  Tab Delimited (TSV)   2D SDfile   Computed 3D by Vconf -m prep SDfile
Find this compound or compounds like it in BindingDB:
Activity Spreadsheet -- Enzyme Inhibition Constant Data from BindingDB
Found 4 hits for monomerid = 50413072
TargetSodium-dependent serotonin transporter(Homo sapiens (Human))
Glaxosmithkline
Curated by ChEMBL
LigandPNGBDBM50413072(CHEMBL495703)
Affinity DataKi:  0.398nM. Assay description: Displacement of [3H]citalopram from human SerT expressed pig LLCPK cells
In DepthDetails ArticlePubMed
Target5-hydroxytryptamine receptor 1B(Homo sapiens (Human))
Glaxosmithkline
Curated by ChEMBL
LigandPNGBDBM50413072(CHEMBL495703)
Affinity DataKi:  1.26nM. Assay description: Displacement of [3H]5HT from human 5HT1B receptor expressed in CHO cells
In DepthDetails ArticlePubMed
Target5-hydroxytryptamine receptor 1D(Homo sapiens (Human))
Glaxosmithkline
Curated by ChEMBL
LigandPNGBDBM50413072(CHEMBL495703)
Affinity DataKi:  1.58nM. Assay description: Displacement of [3H]5HT from human 5HT1D receptor expressed in CHO cells
In DepthDetails ArticlePubMed
Target5-hydroxytryptamine receptor 1A(Homo sapiens (Human))
Glaxosmithkline
Curated by ChEMBL
LigandPNGBDBM50413072(CHEMBL495703)
Affinity DataKi:  3.16nM. Assay description: Displacement of [3H]WAY-100635 from human 5HT1A receptor expressed in CHO cells
In DepthDetails ArticlePubMed