BDBM50413155 CHEMBL486145
SMILES Cc1ccccc1C#Cc1ccc(OCC(O)=O)cc1
InChI Key InChIKey=ZUXGFKWBSMEYJC-UHFFFAOYSA-N
Data  2 EC50
  Tab Delimited (TSV)   2D SDfile   Computed 3D by Vconf -m prep SDfile
Find this compound or compounds like it in BindingDB:
Activity Spreadsheet -- Enzyme Inhibition Constant Data from BindingDB
Found 2 hits for monomerid = 50413155
TargetFree fatty acid receptor 1(Homo sapiens (Human))
China Pharmaceutical University
Curated by ChEMBL
LigandPNGBDBM50413155(CHEMBL486145)
Affinity DataEC50:  3.72E+3nM. Assay description: Agonist activity at FFA1 receptor (unknown origin) stably expressed in CHO cells assessed as increase in calcium flux by Fluo4-AM based FLIPR assay
In DepthDetails ArticlePubMed
TargetFree fatty acid receptor 1(Homo sapiens (Human))
China Pharmaceutical University
Curated by ChEMBL
LigandPNGBDBM50413155(CHEMBL486145)
Affinity DataEC50:  3.72E+3nM. Assay description: Agonist activity at human FFA1 expressed in human 1321N1 cells by calcium fluorescence assay
In DepthDetails ArticlePubMed