BDBM50413888 CHEMBL523156
SMILES C[C@H](N(C)C(=O)N1CCNC[C@H]1c1ccc(F)cc1C)c1cc(cc(c1)C(F)(F)F)C(F)(F)F
InChI Key InChIKey=SBBYBXSFWOLDDG-XOBRGWDASA-N
Data  1 KI
  Tab Delimited (TSV)   2D SDfile   Computed 3D by Vconf -m prep SDfile
Find this compound or compounds like it in BindingDB:
Activity Spreadsheet -- Enzyme Inhibition Constant Data from BindingDB
Found 1 hit for monomerid = 50413888
TargetSubstance-P receptor(Homo sapiens (Human))
Glaxosmithkline
Curated by ChEMBL
LigandPNGBDBM50413888(CHEMBL523156)
Affinity DataKi:  3.72nM. Assay description: Displacement of [3H]substance P from human recombinant NK1 receptor expressed in CHO cells
In DepthDetails ArticlePubMed