BDBM50415140 CHEMBL569933
SMILES CCCc1ccccc1COC1=NCCN1
InChI Key InChIKey=XBWFPEVESQMIBM-UHFFFAOYSA-N
Data  3 KI  2 EC50
  Tab Delimited (TSV)   2D SDfile   Computed 3D by Vconf -m prep SDfile
Find this compound or compounds like it in BindingDB:
Activity Spreadsheet -- Enzyme Inhibition Constant Data from BindingDB
Found 5 hits for monomerid = 50415140
TargetAlpha-2A adrenergic receptor(Homo sapiens (Human))
Universita Degli Studi Di Camerino
Curated by ChEMBL
LigandPNGBDBM50415140(CHEMBL569933)
Affinity DataKi:  49nM. Assay description: Displacement of [3H]RX821002 from human alpha2A adrenoceptor expressed in CHO cell membrane after 30 mins by liquid scintillation counting
In DepthDetails ArticlePubMed
TargetAlpha-2C adrenergic receptor(Homo sapiens (Human))
Universita Degli Studi Di Camerino
Curated by ChEMBL
LigandPNGBDBM50415140(CHEMBL569933)
Affinity DataKi:  490nM. Assay description: Displacement of [3H]RX821002 from human Alpha-2C adrenoceptor expressed in CHO cell membrane after 30 mins by liquid scintillation counting
In DepthDetails ArticlePubMed
TargetAlpha-2B adrenergic receptor(Homo sapiens (Human))
Universita Degli Studi Di Camerino
Curated by ChEMBL
LigandPNGBDBM50415140(CHEMBL569933)
Affinity DataKi:  550nM. Assay description: Displacement of [3H]RX821002 from human alpha2B adrenoceptor expressed in CHO cell membrane after 30 mins by liquid scintillation counting
In DepthDetails ArticlePubMed
TargetAlpha-2B adrenergic receptor(Homo sapiens (Human))
Universita Degli Studi Di Camerino
Curated by ChEMBL
LigandPNGBDBM50415140(CHEMBL569933)
Affinity DataEC50:  62nM. Assay description: Agonist activity at human alpha2B adrenoceptor expressed in CHO cells assessed as extracellular acidification by cytosensor microphysiometry
In DepthDetails ArticlePubMed
TargetAlpha-2C adrenergic receptor(Homo sapiens (Human))
Universita Degli Studi Di Camerino
Curated by ChEMBL
LigandPNGBDBM50415140(CHEMBL569933)
Affinity DataEC50:  155nM. Assay description: Agonist activity at human Alpha-2C adrenoceptor expressed in CHO cells assessed as extracellular acidification by cytosensor microphysiometry
In DepthDetails ArticlePubMed