BDBM50415834 CHEMBL1098901
SMILES CCCN(Cc1ccc2nc(C)[nH]c(=O)c2c1)c1ccc(s1)C(=O)N[C@@H](CCC(O)=O)C(O)=O
InChI Key InChIKey=BYKXWUVZFQIAHX-KRWDZBQOSA-N
Data  1 IC50
  Tab Delimited (TSV)   2D SDfile   Computed 3D by Vconf -m prep SDfile
Find this compound or compounds like it in BindingDB:
Activity Spreadsheet -- Enzyme Inhibition Constant Data from BindingDB
Found 1 hit for monomerid = 50415834
TargetThymidylate synthase(Homo sapiens (Human))
Meerut Institute Of Engineering And Technology
Curated by ChEMBL
LigandPNGBDBM50415834(CHEMBL1098901)
Affinity DataIC50:  1.86E+3nM. Assay description: Inhibition of thymidylate synthase
In DepthDetails ArticlePubMed