BDBM50415837 CHEMBL1095267
SMILES Cc1nc2ccc(CN(CCO)c3ccc(s3)C(=O)N[C@@H](CCC(O)=O)C(O)=O)cc2c(=O)[nH]1
InChI Key InChIKey=PQDODGYVNZOBOU-INIZCTEOSA-N
Data  1 IC50
  Tab Delimited (TSV)   2D SDfile   Computed 3D by Vconf -m prep SDfile
Find this compound or compounds like it in BindingDB:
Activity Spreadsheet -- Enzyme Inhibition Constant Data from BindingDB
Found 1 hit for monomerid = 50415837
TargetThymidylate synthase(Homo sapiens (Human))
Meerut Institute Of Engineering And Technology
Curated by ChEMBL
LigandPNGBDBM50415837(CHEMBL1095267)
Affinity DataIC50:  1.20E+3nM. Assay description: Inhibition of thymidylate synthase
In DepthDetails ArticlePubMed