BDBM50415838 CHEMBL1095593
SMILES Cc1nc2ccc(CN(CCCO)c3ccc(s3)C(=O)N[C@@H](CCC(O)=O)C(O)=O)cc2c(=O)[nH]1
InChI Key InChIKey=UGTDJDQIIPPMJE-KRWDZBQOSA-N
Data  1 IC50
  Tab Delimited (TSV)   2D SDfile   Computed 3D by Vconf -m prep SDfile
Find this compound or compounds like it in BindingDB:
Activity Spreadsheet -- Enzyme Inhibition Constant Data from BindingDB
Found 1 hit for monomerid = 50415838
TargetThymidylate synthase(Homo sapiens (Human))
Meerut Institute Of Engineering And Technology
Curated by ChEMBL
LigandPNGBDBM50415838(CHEMBL1095593)
Affinity DataIC50:  3.39E+3nM. Assay description: Inhibition of thymidylate synthase
In DepthDetails ArticlePubMed